Reaction Details
TargetCholesteryl ester transfer protein
LigandBDBM50178700
Substrate/Competitorn/a
Meas. Tech.ChEMBL_1583724 (CHEMBL3815811)
IC50 2.9±n/a nM
Citation Jiang, JFinlay, HJohnson, JAHarikrishnan, LKamau, MQiao, JWang, TAdam, LTaylor, DYang, RSleph, PChen, AYAYin, XWexler, RSalvati, ME Discovery of hydroxyl 1,2-diphenylethanamine analogs as potent cholesterol ester transfer protein inhibitors. Bioorg Med Chem Lett26:3278-3281 (2016) 
 
Cholesteryl ester transfer protein
Name:Cholesteryl ester transfer protein
Type:Enzyme
Mol. Mass.:54751.53
Organism:Homo sapiens (Human)
Description:P11597
Residue:493
BDBM50178700
NameBDBM50178700
Synonyms:CHEMBL3814418
TypeSmall organic molecule
Emp. Form.C28H26F9NO3
Mol. Mass.595.4966
SMILESCC(C)Oc1cc(ccc1F)[C@@](Cc1ccccc1)(NC[C@H](O)C(F)(F)F)c1cc(F)cc(OC(F)(F)C(F)F)c1