Reaction Details
TargetCholesteryl ester transfer protein
LigandBDBM50178702
Substrate/Competitorn/a
Meas. Tech.ChEMBL_1583724 (CHEMBL3815811)
IC50 2.5±n/a nM
Citation Jiang, JFinlay, HJohnson, JAHarikrishnan, LKamau, MQiao, JWang, TAdam, LTaylor, DYang, RSleph, PChen, AYAYin, XWexler, RSalvati, ME Discovery of hydroxyl 1,2-diphenylethanamine analogs as potent cholesterol ester transfer protein inhibitors. Bioorg Med Chem Lett26:3278-3281 (2016) 
 
Cholesteryl ester transfer protein
Name:Cholesteryl ester transfer protein
Type:Enzyme
Mol. Mass.:54751.53
Organism:Homo sapiens (Human)
Description:P11597
Residue:493
BDBM50178702
NameBDBM50178702
Synonyms:CHEMBL3814963
TypeSmall organic molecule
Emp. Form.C29H28F9NO3
Mol. Mass.609.5231
SMILESCC(C)Oc1cc(ccc1F)[C@@](Cc1ccccc1)(NC[C@@H](O)CC(F)(F)F)c1cc(F)cc(OC(F)(F)C(F)F)c1