Reaction Details
TargetC-C chemokine receptor type 9
LigandBDBM50178707
Substrate/Competitorn/a
Meas. Tech.ChEMBL_1583886 (CHEMBL3815318)
IC50 218±n/a nM
Citation Pandya, BABaber, CChan, AChamberlain, BChandonnet, HGoss, JHopper, TLippa, BPoutsiaka, KRomero, JStucka, SVaroglu, MZhang, JZhang, X Discovery of indole inhibitors of chemokine receptor 9 (CCR9). Bioorg Med Chem Lett26:3322-3325 (2016) 
 
C-C chemokine receptor type 9
Name:C-C chemokine receptor type 9
Type:PROTEIN
Mol. Mass.:42023.90
Organism:Homo sapiens (Human)
Description:ChEMBL_1510356
Residue:369
BDBM50178707
NameBDBM50178707
Synonyms:CHEMBL3814811
TypeSmall organic molecule
Emp. Form.C20H21ClN2O3
Mol. Mass.372.845
SMILESCOCC(C)(C)c1ccc(Cn2c(cc3ncc(Cl)cc23)C(O)=O)cc1