Reaction Details
TargetC-C chemokine receptor type 9
LigandBDBM50178711
Substrate/Competitorn/a
Meas. Tech.ChEMBL_1583874 (CHEMBL3815306)
IC50 85±n/a nM
Citation Pandya, BABaber, CChan, AChamberlain, BChandonnet, HGoss, JHopper, TLippa, BPoutsiaka, KRomero, JStucka, SVaroglu, MZhang, JZhang, X Discovery of indole inhibitors of chemokine receptor 9 (CCR9). Bioorg Med Chem Lett26:3322-3325 (2016) 
 
C-C chemokine receptor type 9
Name:C-C chemokine receptor type 9
Type:PROTEIN
Mol. Mass.:42023.90
Organism:Homo sapiens (Human)
Description:ChEMBL_1510356
Residue:369
BDBM50178711
NameBDBM50178711
Synonyms:CHEMBL3814176
TypeSmall organic molecule
Emp. Form.C21H23NO2
Mol. Mass.321.4128
SMILESCc1ccc2cc(C(O)=O)n(Cc3ccc(cc3)C(C)(C)C)c2c1