Reaction Details
Target5-hydroxytryptamine receptor 2A
LigandBDBM50178980
Substrate/Competitorn/a
Meas. Tech.ChEMBL_1582550 (CHEMBL3816812)
Ki 54±n/a nM
Citation Kapadia, NAhmed, SHarding, WW New halogenated tris-(phenylalkyl)amines as h5-HT2B receptor ligands. Bioorg Med Chem Lett26:3216-3219 (2016) 
 
5-hydroxytryptamine receptor 2A
Name:5-hydroxytryptamine receptor 2A
Type:undefined
Mol. Mass.:52607.65
Organism:Homo sapiens (Human)
Description:P28223
Residue:471
BDBM50178980
NameBDBM50178980
Synonyms:CHEMBL3813726
TypeSmall organic molecule
Emp. Form.C28H32BrNO4
Mol. Mass.526.462
SMILESCOc1ccc(CCN(CCCc2ccccc2Br)CCc2ccc3OCOc3c2)cc1OC