Reaction Details
Target5-hydroxytryptamine receptor 2B
LigandBDBM50178978
Substrate/Competitorn/a
Meas. Tech.ChEMBL_1582551 (CHEMBL3816813)
Ki 1.7±n/a nM
Citation Kapadia, NAhmed, SHarding, WW New halogenated tris-(phenylalkyl)amines as h5-HT2B receptor ligands. Bioorg Med Chem Lett26:3216-3219 (2016) 
 
5-hydroxytryptamine receptor 2B
Name:5-hydroxytryptamine receptor 2B
Type:G Protein-Coupled Receptor (GPCR)
Mol. Mass.:54312.47
Organism:Homo sapiens (Human)
Description:Receptor binding assays were performed using human clone stably expressed in CHO cells.
Residue:481
BDBM50178978
NameBDBM50178978
Synonyms:CHEMBL3815112
TypeSmall organic molecule
Emp. Form.C28H32FNO4
Mol. Mass.465.5564
SMILESCOc1ccc(CCN(CCCc2ccccc2F)CCc2ccc3OCOc3c2)cc1OC