Reaction Details
Target5-hydroxytryptamine receptor 2B
LigandBDBM82272
Substrate/Competitorn/a
Meas. Tech.ChEMBL_1582551 (CHEMBL3816813)
Ki 21±n/a nM
Citation Kapadia, NAhmed, SHarding, WW New halogenated tris-(phenylalkyl)amines as h5-HT2B receptor ligands. Bioorg Med Chem Lett26:3216-3219 (2016) 
 
5-hydroxytryptamine receptor 2B
Name:5-hydroxytryptamine receptor 2B
Type:G Protein-Coupled Receptor (GPCR)
Mol. Mass.:54312.47
Organism:Homo sapiens (Human)
Description:Receptor binding assays were performed using human clone stably expressed in CHO cells.
Residue:481
BDBM82272
NameBDBM82272
Synonyms:SB 200646 | SB200646a
Typen/a
Emp. Form.C15H14N4O
Mol. Mass.266.2979
SMILESCn1ccc2cc(NC(=O)Nc3cccnc3)ccc12