Reaction Details
TargetAlpha-2A adrenergic receptor
LigandBDBM50179386
Substrate/Competitorn/a
Meas. Tech.ChEMBL_1583766 (CHEMBL3815853)
Ki 52000±n/a nM
Citation Vucicevic, JSrdic-Rajic, TPieroni, MLaurila, JMPerovic, VTassini, SAzzali, ECostantino, GGlisic, SAgbaba, DScheinin, MNikolic, KRadi, MVeljkovic, N A combined ligand- and structure-based approach for the identification of rilmenidine-derived compounds which synergize the antitumor effects of doxorubicin. Bioorg Med Chem24:3174-83 (2016) 
 
Alpha-2A adrenergic receptor
Name:Alpha-2A adrenergic receptor
Type:Enzyme
Mol. Mass.:48979.91
Organism:Homo sapiens (Human)
Description:P08913
Residue:465
BDBM50179386
NameBDBM50179386
Synonyms:CHEMBL3814626
TypeSmall organic molecule
Emp. Form.C16H28N2O
Mol. Mass.264.4063
SMILESCC(C)CCNc1cc(C)n(CCC(C)C)c(=O)c1