Reaction Details
TargetAlpha-2A adrenergic receptor
LigandBDBM50179391
Substrate/Competitorn/a
Meas. Tech.ChEMBL_1583766 (CHEMBL3815853)
Ki 1200±n/a nM
Citation Vucicevic, JSrdic-Rajic, TPieroni, MLaurila, JMPerovic, VTassini, SAzzali, ECostantino, GGlisic, SAgbaba, DScheinin, MNikolic, KRadi, MVeljkovic, N A combined ligand- and structure-based approach for the identification of rilmenidine-derived compounds which synergize the antitumor effects of doxorubicin. Bioorg Med Chem24:3174-83 (2016) 
 
Alpha-2A adrenergic receptor
Name:Alpha-2A adrenergic receptor
Type:Enzyme
Mol. Mass.:48979.91
Organism:Homo sapiens (Human)
Description:P08913
Residue:465
BDBM50179391
NameBDBM50179391
Synonyms:CHEMBL3593723
TypeSmall organic molecule
Emp. Form.C20H24N2
Mol. Mass.292.418
SMILESCN1CCCCC1CCn1c2ccccc2c2ccccc12