Reaction Details
TargetCytochrome P450 1A2
LigandBDBM50180842
Substrate/Competitorn/a
Meas. Tech.ChEMBL_1584743 (CHEMBL3821694)
IC50 5200±n/a nM
Citation Carosati, ECosimelli, BIoan, PSeveri, EKatneni, KChiu, FCSaponara, SFusi, FFrosini, MMatucci, RMicucci, MChiarini, ASpinelli, DBudriesi, R Understanding Oxadiazolothiazinone Biological Properties: Negative Inotropic Activity versus Cytochrome P450-Mediated Metabolism. J Med Chem59:3340-52 (2016) 
 
Cytochrome P450 1A2
Name:Cytochrome P450 1A2
Type:Enzyme
Mol. Mass.:58423.38
Organism:Homo sapiens (Human)
Description:P05177
Residue:516
BDBM50180842
NameBDBM50180842
Synonyms:CHEMBL3818643
TypeSmall organic molecule
Emp. Form.C15H16N2O4S
Mol. Mass.320.364
SMILESCCOC1(SC=C(C)n2c1noc2=O)c1ccc(OC)cc1