Reaction Details
TargetCytochrome P450 1A2
LigandBDBM50180847
Substrate/Competitorn/a
Meas. Tech.ChEMBL_1584743 (CHEMBL3821694)
IC50 5000±n/a nM
Citation Carosati, ECosimelli, BIoan, PSeveri, EKatneni, KChiu, FCSaponara, SFusi, FFrosini, MMatucci, RMicucci, MChiarini, ASpinelli, DBudriesi, R Understanding Oxadiazolothiazinone Biological Properties: Negative Inotropic Activity versus Cytochrome P450-Mediated Metabolism. J Med Chem59:3340-52 (2016) 
 
Cytochrome P450 1A2
Name:Cytochrome P450 1A2
Type:Enzyme
Mol. Mass.:58423.38
Organism:Homo sapiens (Human)
Description:P05177
Residue:516
BDBM50180847
NameBDBM50180847
Synonyms:CHEMBL3408523
TypeSmall organic molecule
Emp. Form.C14H10BrF3N2O3S
Mol. Mass.423.205
SMILESCC1=CSC(OCC(F)(F)F)(c2noc(=O)n12)c1ccc(Br)cc1