Reaction Details
TargetCytochrome P450 2C9
LigandBDBM50180841
Substrate/Competitorn/a
Meas. Tech.ChEMBL_1584744 (CHEMBL3821695)
IC50 18400±n/a nM
Citation Carosati, ECosimelli, BIoan, PSeveri, EKatneni, KChiu, FCSaponara, SFusi, FFrosini, MMatucci, RMicucci, MChiarini, ASpinelli, DBudriesi, R Understanding Oxadiazolothiazinone Biological Properties: Negative Inotropic Activity versus Cytochrome P450-Mediated Metabolism. J Med Chem59:3340-52 (2016) 
 
Cytochrome P450 2C9
Name:Cytochrome P450 2C9
Type:Enzyme
Mol. Mass.:55636.33
Organism:Homo sapiens (Human)
Description:P11712
Residue:490
BDBM50180841
NameBDBM50180841
Synonyms:CHEMBL3819606
TypeSmall organic molecule
Emp. Form.C14H11F3N2O3S
Mol. Mass.344.309
SMILESCC1=CSC(OCC(F)(F)F)(c2noc(=O)n12)c1ccccc1