Reaction Details
TargetCytochrome P450 2C9
LigandBDBM50180846
Substrate/Competitorn/a
Meas. Tech.ChEMBL_1584744 (CHEMBL3821695)
IC50 18400±n/a nM
Citation Carosati, ECosimelli, BIoan, PSeveri, EKatneni, KChiu, FCSaponara, SFusi, FFrosini, MMatucci, RMicucci, MChiarini, ASpinelli, DBudriesi, R Understanding Oxadiazolothiazinone Biological Properties: Negative Inotropic Activity versus Cytochrome P450-Mediated Metabolism. J Med Chem59:3340-52 (2016) 
 
Cytochrome P450 2C9
Name:Cytochrome P450 2C9
Type:Enzyme
Mol. Mass.:55636.33
Organism:Homo sapiens (Human)
Description:P11712
Residue:490
BDBM50180846
NameBDBM50180846
Synonyms:CHEMBL211204
TypeSmall organic molecule
Emp. Form.C14H13BrN2O3S
Mol. Mass.369.234
SMILESCCOC1(SC=C(C)n2c1noc2=O)c1ccc(Br)cc1