Reaction Details
TargetCytochrome P450 2C19
LigandBDBM50180844
Substrate/Competitorn/a
Meas. Tech.ChEMBL_1584739 (CHEMBL3821541)
IC50 3600±n/a nM
Citation Carosati, ECosimelli, BIoan, PSeveri, EKatneni, KChiu, FCSaponara, SFusi, FFrosini, MMatucci, RMicucci, MChiarini, ASpinelli, DBudriesi, R Understanding Oxadiazolothiazinone Biological Properties: Negative Inotropic Activity versus Cytochrome P450-Mediated Metabolism. J Med Chem59:3340-52 (2016) 
 
Cytochrome P450 2C19
Name:Cytochrome P450 2C19
Type:Enzyme
Mol. Mass.:55935.47
Organism:Homo sapiens (Human)
Description:P33261
Residue:490
BDBM50180844
NameBDBM50180844
Synonyms:CHEMBL3818560
TypeSmall organic molecule
Emp. Form.C18H16N2O4S
Mol. Mass.356.396
SMILESCCOC1(Sc2ccccc2-n2c1noc2=O)c1ccc(OC)cc1