Reaction Details
TargetCytochrome P450 2C19
LigandBDBM50180845
Substrate/Competitorn/a
Meas. Tech.ChEMBL_1584739 (CHEMBL3821541)
IC50 17000±n/a nM
Citation Carosati, ECosimelli, BIoan, PSeveri, EKatneni, KChiu, FCSaponara, SFusi, FFrosini, MMatucci, RMicucci, MChiarini, ASpinelli, DBudriesi, R Understanding Oxadiazolothiazinone Biological Properties: Negative Inotropic Activity versus Cytochrome P450-Mediated Metabolism. J Med Chem59:3340-52 (2016) 
 
Cytochrome P450 2C19
Name:Cytochrome P450 2C19
Type:Enzyme
Mol. Mass.:55935.47
Organism:Homo sapiens (Human)
Description:P33261
Residue:490
BDBM50180845
NameBDBM50180845
Synonyms:CHEMBL3819349
TypeSmall organic molecule
Emp. Form.C18H13F3N2O4S
Mol. Mass.410.367
SMILESCOc1ccc(cc1)C1(OCC(F)(F)F)Sc2ccccc2-n2c1noc2=O