Reaction Details
TargetCytochrome P450 2C19
LigandBDBM85509
Substrate/Competitorn/a
Meas. Tech.ChEMBL_1584739 (CHEMBL3821541)
IC50 1300±n/a nM
Citation Carosati, ECosimelli, BIoan, PSeveri, EKatneni, KChiu, FCSaponara, SFusi, FFrosini, MMatucci, RMicucci, MChiarini, ASpinelli, DBudriesi, R Understanding Oxadiazolothiazinone Biological Properties: Negative Inotropic Activity versus Cytochrome P450-Mediated Metabolism. J Med Chem59:3340-52 (2016) 
 
Cytochrome P450 2C19
Name:Cytochrome P450 2C19
Type:Enzyme
Mol. Mass.:55935.47
Organism:Homo sapiens (Human)
Description:P33261
Residue:490
BDBM85509
NameBDBM85509
Synonyms:CAS_55142-85-3 Ticlopidine
TypeSmall organic molecule
Emp. Form.C14H14ClNS
Mol. Mass.263.786
SMILESClc1ccccc1CN1CCc2sccc2C1