Reaction Details
TargetCytochrome P450 3A4
LigandBDBM50180846
Substrate/Competitorn/a
Meas. Tech.ChEMBL_1584592 (CHEMBL3820761)
IC50>20000±n/a nM
Citation Carosati, ECosimelli, BIoan, PSeveri, EKatneni, KChiu, FCSaponara, SFusi, FFrosini, MMatucci, RMicucci, MChiarini, ASpinelli, DBudriesi, R Understanding Oxadiazolothiazinone Biological Properties: Negative Inotropic Activity versus Cytochrome P450-Mediated Metabolism. J Med Chem59:3340-52 (2016) 
 
Cytochrome P450 3A4
Name:Cytochrome P450 3A4
Type:Enzyme
Mol. Mass.:57349.57
Organism:Homo sapiens (Human)
Description:n/a
Residue:503
BDBM50180846
NameBDBM50180846
Synonyms:CHEMBL211204
TypeSmall organic molecule
Emp. Form.C14H13BrN2O3S
Mol. Mass.369.234
SMILESCCOC1(SC=C(C)n2c1noc2=O)c1ccc(Br)cc1