Reaction Details
TargetCytochrome P450 3A4
LigandBDBM50180840
Substrate/Competitorn/a
Meas. Tech.ChEMBL_1584799 (CHEMBL3821882)
IC50 19100±n/a nM
Citation Carosati, ECosimelli, BIoan, PSeveri, EKatneni, KChiu, FCSaponara, SFusi, FFrosini, MMatucci, RMicucci, MChiarini, ASpinelli, DBudriesi, R Understanding Oxadiazolothiazinone Biological Properties: Negative Inotropic Activity versus Cytochrome P450-Mediated Metabolism. J Med Chem59:3340-52 (2016) 
 
Cytochrome P450 3A4
Name:Cytochrome P450 3A4
Type:Enzyme
Mol. Mass.:57349.57
Organism:Homo sapiens (Human)
Description:n/a
Residue:503
BDBM50180840
NameBDBM50180840
Synonyms:CHEMBL3819185
TypeSmall organic molecule
Emp. Form.C14H14N2O3S
Mol. Mass.290.338
SMILESCCOC1(SC=C(C)n2c1noc2=O)c1ccccc1