Reaction Details
TargetStromal cell-derived factor 1
LigandBDBM50180879
Substrate/Competitorn/a
Meas. Tech.ChEMBL_1585148 (CHEMBL3820796)
Kd 4100000±n/a nM
Citation Smith, EWNevins, AMQiao, ZLiu, YGetschman, AEVankayala, SLKemp, MTPeterson, FCLi, RVolkman, BFChen, Y Structure-Based Identification of Novel Ligands Targeting Multiple Sites within a Chemokine-G-Protein-Coupled-Receptor Interface. J Med Chem59:4342-51 (2016) 
 
Stromal cell-derived factor 1
Name:Stromal cell-derived factor 1
Type:Enzyme
Mol. Mass.:10677.83
Organism:Homo sapiens (Human)
Description:P48061
Residue:93
BDBM50180879
NameBDBM50180879
Synonyms:CHEMBL3818292
TypeSmall organic molecule
Emp. Form.C18H17FN2O3
Mol. Mass.328.3376
SMILESOC(=O)CC1N(CCc2ccccc12)C(=O)Nc1cccc(F)c1