Reaction Details
TargetStromal cell-derived factor 1
LigandBDBM50180881
Substrate/Competitorn/a
Meas. Tech.ChEMBL_1585155 (CHEMBL3820803)
Kd 200000±n/a nM
Citation Smith, EWNevins, AMQiao, ZLiu, YGetschman, AEVankayala, SLKemp, MTPeterson, FCLi, RVolkman, BFChen, Y Structure-Based Identification of Novel Ligands Targeting Multiple Sites within a Chemokine-G-Protein-Coupled-Receptor Interface. J Med Chem59:4342-51 (2016) 
 
Stromal cell-derived factor 1
Name:Stromal cell-derived factor 1
Type:Enzyme
Mol. Mass.:10677.83
Organism:Homo sapiens (Human)
Description:P48061
Residue:93
BDBM50180881
NameBDBM50180881
Synonyms:CHEMBL3818778
TypeSmall organic molecule
Emp. Form.C13H11N3O5S
Mol. Mass.321.309
SMILESOC(=O)COc1nc(SCC(O)=O)nc(n1)-c1ccccc1