Reaction Details
TargetSigma non-opioid intracellular receptor 1
LigandBDBM50181060
Substrate/Competitorn/a
Meas. Tech.ChEMBL_1584462 (CHEMBL3820109)
Ki 0.500000±n/a nM
Citation Weber, FBrune, SBörgel, FLange, CKorpis, KBednarski, PJLaurini, EFermeglia, MPricl, SSchepmann, DWünsch, B Rigidity versus Flexibility: Is This an Issue ins1 Receptor Ligand Affinity and Activity? J Med Chem59:5505-19 (2016) 
 
Sigma non-opioid intracellular receptor 1
Name:Sigma non-opioid intracellular receptor 1
Type:Protein
Mol. Mass.:25307.17
Organism:Cavia porcellus (Guinea pig)
Description:Q60492
Residue:223
BDBM50181060
NameBDBM50181060
Synonyms:CHEMBL3817940
TypeSmall organic molecule
Emp. Form.C24H32N2O
Mol. Mass.364.5237
SMILES[H][C@]12C[C@H](O)[C@]([H])(CN1Cc1cccc3ccccc13)N(CC1CCCCC1)C2