Reaction Details
TargetSerine/threonine-protein kinase PAK 1
LigandBDBM50181452
Substrate/Competitorn/a
Meas. Tech.ChEBML_1584620
Ki 11±n/a nM
Citation Rudolph, JMurray, LJNdubaku, COO'Brien, TBlackwood, EWang, WAliagas, IGazzard, LCrawford, JJDrobnick, JLee, WZhao, XHoeflich, KPFavor, DADong, PZhang, HHeise, CEOh, AOng, CCLa, HChakravarty, PChan, CJakubiak, DEpler, JRamaswamy, SVega, RCain, GDiaz, DZhong, Y Chemically Diverse Group I p21-Activated Kinase (PAK) Inhibitors Impart Acute Cardiovascular Toxicity with a Narrow Therapeutic Window. J Med Chem59:5520-41 (2016) 
 
Serine/threonine-protein kinase PAK 1
Name:Serine/threonine-protein kinase PAK 1
Type:n/a
Mol. Mass.:60640.15
Organism:Homo sapiens (Human)
Description:Q13153
Residue:545
BDBM50181452
NameBDBM50181452
Synonyms:CHEMBL3819118
TypeSmall organic molecule
Emp. Form.C26H27ClN6O3
Mol. Mass.506.984
SMILESCCc1cccn(-c2ccc(c(Cl)c2)-c2cc3cnc(NC)nc3n(C[C@H]3CNCCO3)c2=O)c1=O