Reaction Details
TargetSerine/threonine-protein kinase PAK 1
LigandBDBM50182291
Substrate/Competitorn/a
Meas. Tech.ChEBML_1584620
Ki 17±n/a nM
Citation Rudolph, JMurray, LJNdubaku, COO'Brien, TBlackwood, EWang, WAliagas, IGazzard, LCrawford, JJDrobnick, JLee, WZhao, XHoeflich, KPFavor, DADong, PZhang, HHeise, CEOh, AOng, CCLa, HChakravarty, PChan, CJakubiak, DEpler, JRamaswamy, SVega, RCain, GDiaz, DZhong, Y Chemically Diverse Group I p21-Activated Kinase (PAK) Inhibitors Impart Acute Cardiovascular Toxicity with a Narrow Therapeutic Window. J Med Chem59:5520-41 (2016) 
 
Serine/threonine-protein kinase PAK 1
Name:Serine/threonine-protein kinase PAK 1
Type:n/a
Mol. Mass.:60640.15
Organism:Homo sapiens (Human)
Description:Q13153
Residue:545
BDBM50182291
NameBDBM50182291
Synonyms:CHEMBL3818138
TypeSmall organic molecule
Emp. Form.C22H20ClN5O3
Mol. Mass.437.879
SMILESCNc1ncc2cc(-c3ccc(cc3Cl)-n3cccc(C)c3=O)c(=O)n(CCO)c2n1