Reaction Details
TargetSerine/threonine-protein kinase PAK 1
LigandBDBM50182294
Substrate/Competitorn/a
Meas. Tech.ChEBML_1584620
Ki 6.3±n/a nM
Citation Rudolph, JMurray, LJNdubaku, COO'Brien, TBlackwood, EWang, WAliagas, IGazzard, LCrawford, JJDrobnick, JLee, WZhao, XHoeflich, KPFavor, DADong, PZhang, HHeise, CEOh, AOng, CCLa, HChakravarty, PChan, CJakubiak, DEpler, JRamaswamy, SVega, RCain, GDiaz, DZhong, Y Chemically Diverse Group I p21-Activated Kinase (PAK) Inhibitors Impart Acute Cardiovascular Toxicity with a Narrow Therapeutic Window. J Med Chem59:5520-41 (2016) 
 
Serine/threonine-protein kinase PAK 1
Name:Serine/threonine-protein kinase PAK 1
Type:n/a
Mol. Mass.:60640.15
Organism:Homo sapiens (Human)
Description:Q13153
Residue:545
BDBM50182294
NameBDBM50182294
Synonyms:CHEMBL3817984
TypeSmall organic molecule
Emp. Form.C24H22ClN5O3
Mol. Mass.463.916
SMILESCCn1c2nc(NC3COC3)ncc2cc(-c2ccc(cc2Cl)-n2cccc(C)c2=O)c1=O