Reaction Details
TargetDual specificity protein kinase TTK
LigandBDBM50183021
Substrate/Competitorn/a
Meas. Tech.ChEMBL_1586153 (CHEMBL3821249)
IC50 0.400000±n/a nM
Citation Laufer, RLi, SWLiu, YNg, GLang, YFeher, MBrokx, RBeletskaya, IHodgson, RMao, GPlotnikova, OAwrey, DEMason, JMWei, XLin, DCChe, YKiarash, RMadeira, BFletcher, GCMak, TWBray, MRPauls, HW Discovery of 4-(4-aminopyrazolo[1,5-a][1,3,5]triazin-8-yl)benzamides as novel, highly potent and selective, orally bioavailable inhibitors of Tyrosine Threonine Kinase, TTK. Bioorg Med Chem Lett26:3562-6 (2016) 
 
Dual specificity protein kinase TTK
Name:Dual specificity protein kinase TTK
Type:Protein
Mol. Mass.:97086.79
Organism:Homo sapiens (Human)
Description:P33981
Residue:857
BDBM50183021
NameBDBM50183021
Synonyms:CHEMBL3818646
TypeSmall organic molecule
Emp. Form.C28H28F2N6O3
Mol. Mass.534.5571
SMILESCc1cc(ccc1C(=O)NC1CC1)-c1cnn2c(NCC3CCOCC3)nc(Oc3cccc(F)c3F)nc12