Reaction Details
TargetD(4) dopamine receptor
LigandBDBM50183266
Substrate/Competitorn/a
Meas. Tech.ChEMBL_1586242 (CHEMBL3820060)
Ki 0.066000±n/a nM
Citation Etukala, JRZhu, XYEyunni, SVOnyameh, EKOfori, EBricker, BAKang, HJHuang, XPRoth, BLAblordeppey, SY Development of CNS multi-receptor ligands: Modification of known D2 pharmacophores. Bioorg Med Chem24:3671-9 (2016) 
 
D(4) dopamine receptor
Name:D(4) dopamine receptor
Type:Enzyme
Mol. Mass.:48373.19
Organism:Homo sapiens (Human)
Description:P21917
Residue:419
BDBM50183266
NameBDBM50183266
Synonyms:Anquil Benquil R-4584
TypeSmall organic molecule
Emp. Form.C22H24FN3O2
Mol. Mass.381.4433
SMILESOc1nc2ccccc2n1C1CCN(CCCC(=O)c2ccc(F)cc2)CC1