Reaction Details
TargetReceptor-interacting serine/threonine-protein kinase 2
LigandBDBM50184477
Substrate/Competitorn/a
Meas. Tech.ChEMBL_1587102 (CHEMBL3825637)
IC50 790±n/a nM
Citation Haile, PAVotta, BJMarquis, RWBury, MJMehlmann, JFSinghaus, RCharnley, AKLakdawala, ASConvery, MALipshutz, DBDesai, BMSwift, BCapriotti, CABerger, SBMahajan, MKReilly, MARivera, EJSun, HHNagilla, RBeal, AMFinger, JNCook, MNKing, BWOuellette, MTTotoritis, RDPierdomenico, MNegroni, AStronati, LCucchiara, SZiólkowski, BVossenkämper, AMacDonald, TTGough, PJBertin, JCasillas, LN The Identification and Pharmacological Characterization of 6-(tert-Butylsulfonyl)-N-(5-fluoro-1H-indazol-3-yl)quinolin-4-amine (GSK583), a Highly Potent and Selective Inhibitor of RIP2 Kinase. J Med Chem59:4867-80 (2016) 
 
Receptor-interacting serine/threonine-protein kinase 2
Name:Receptor-interacting serine/threonine-protein kinase 2
Type:Protein
Mol. Mass.:61201.30
Organism:Homo sapiens (Human)
Description:n/a
Residue:540
BDBM50184477
NameBDBM50184477
Synonyms:CHEMBL3822979
TypeSmall organic molecule
Emp. Form.C20H15F5N4O2
Mol. Mass.438.3507
SMILESCNc1cc(Oc2c(F)cc(NC(=O)Nc3cccc(c3)C(F)(F)F)cc2F)ccn1