Reaction Details
TargetNuclear receptor subfamily 1 group I member 3
LigandBDBM50030476
Substrate/Competitorn/a
Meas. Tech.ChEMBL_1587671 (CHEMBL3825785)
EC50 20±n/a nM
Citation Smutny, TNova, ADrechslerová, MCarazo, AHyrsova, LHru?ková, ZRKune?, JPour, M?pulák, MPavek, P 2-(3-Methoxyphenyl)quinazoline Derivatives: A New Class of Direct Constitutive Androstane Receptor (CAR) Agonists. J Med Chem59:4601-10 (2016) 
 
Nuclear receptor subfamily 1 group I member 3
Name:Nuclear receptor subfamily 1 group I member 3
Type:PROTEIN
Mol. Mass.:39953.17
Organism:Homo sapiens (Human)
Description:ChEMBL_1434936
Residue:352
BDBM50030476
NameBDBM50030476
Synonyms:CHEMBL458603
TypeSmall organic molecule
Emp. Form.C19H12Cl3N3OS
Mol. Mass.436.742
SMILESClc1ccc(cc1)-c1nc2sccn2c1\C=N\OCc1ccc(Cl)c(Cl)c1