Reaction Details
TargetTranslocator protein
LigandBDBM50186098
Substrate/Competitorn/a
Meas. Tech.ChEMBL_1587255 (CHEMBL3826071)
Ki>10000±n/a nM
Citation Li, JSchulte, MLNickels, MLManning, HC New structure-activity relationships of N-acetamide substituted pyrazolopyrimidines as pharmacological ligands of TSPO. Bioorg Med Chem Lett26:3472-7 (2016) 
 
Translocator protein
Name:Translocator protein
Type:Mitochondrion membrane protein
Mol. Mass.:18945.84
Organism:Rattus norvegicus (rat)
Description:Competitive binding experiments were performed on rat kidney mitochondrial membranes.
Residue:169
BDBM50186098
NameBDBM50186098
Synonyms:CHEMBL3822812
TypeSmall organic molecule
Emp. Form.C27H30N4O2
Mol. Mass.442.5527
SMILESCCN(C(=O)Cc1c(nn2c(CC)cc(CC)nc12)-c1ccc(OC)cc1)c1ccccc1