Reaction Details
TargetEstrogen receptor
LigandBDBM50186727
Substrate/Competitorn/a
Meas. Tech.ChEMBL_1587749 (CHEMBL3825990)
IC50 380±n/a nM
Citation Kelly, PMBright, SAFayne, DPollock, JKZisterer, DMWilliams, DCMeegan, MJ Synthesis, antiproliferative and pro-apoptotic activity of 2-phenylindoles. Bioorg Med Chem24:4075-4099 (2016) 
 
Estrogen receptor
Name:Estrogen receptor
Type:Protein
Mol. Mass.:66230.44
Organism:Homo sapiens (Human)
Description:P03372
Residue:595
BDBM50186727
NameBDBM50186727
Synonyms:CHEMBL3823498
TypeSmall organic molecule
Emp. Form.C28H40N2O2
Mol. Mass.436.6294
n1c(c(C)c2cc(O)ccc12)-c1ccc(O)cc1