Reaction Details
TargetPeroxisome proliferator-activated receptor delta
LigandBDBM50127222
Substrate/Competitorn/a
Meas. Tech.ChEMBL_1589716 (CHEMBL3829991)
EC50 67±n/a nM
Citation Thach, TTLee, CKPark, HWLee, SJLee, SJ Syringaresinol induces mitochondrial biogenesis through activation of PPARß pathway in skeletal muscle cells. Bioorg Med Chem Lett26:3978-83 (2016) 
 
Peroxisome proliferator-activated receptor delta
Name:Peroxisome proliferator-activated receptor delta
Type:Enzyme
Mol. Mass.:49910.45
Organism:Homo sapiens (Human)
Description:Q03181
Residue:441
BDBM50127222
NameBDBM50127222
Synonyms:CHEMBL38508 {4-[2-(3-Fluoro-4-trifluoromethyl-phenyl)-4-methyl-thiazol-5-ylmethylsulfanyl]-2-methyl-phenoxy}-acetic acid
TypeSmall organic molecule
Emp. Form.C21H17F4NO3S2
Mol. Mass.471.488
SMILESCc1nc(sc1CSc1ccc(OCC(O)=O)c(C)c1)-c1ccc(c(F)c1)C(F)(F)F