Reaction Details
TargetPeroxisome proliferator-activated receptor delta
LigandBDBM50349826
Substrate/Competitorn/a
Meas. Tech.ChEMBL_1589717 (CHEMBL3829992)
Kd 27620±n/a nM
Citation Thach, TTLee, CKPark, HWLee, SJLee, SJ Syringaresinol induces mitochondrial biogenesis through activation of PPARß pathway in skeletal muscle cells. Bioorg Med Chem Lett26:3978-83 (2016) 
 
Peroxisome proliferator-activated receptor delta
Name:Peroxisome proliferator-activated receptor delta
Type:Enzyme
Mol. Mass.:49910.45
Organism:Homo sapiens (Human)
Description:Q03181
Residue:441
BDBM50349826
NameBDBM50349826
Synonyms:SYRINGARESINOL
TypeSmall organic molecule
Emp. Form.C22H26O8
Mol. Mass.418.437
SMILESCOc1cc(cc(OC)c1O)[C@H]1OC[C@H]2[C@@H]1CO[C@@H]2c1cc(OC)c(O)c(OC)c1