Reaction Details
TargetFatty acid-binding protein, adipocyte
LigandBDBM50187493
Substrate/Competitorn/a
Meas. Tech.ChEMBL_1589882 (CHEMBL3830762)
Ki 5400±n/a nM
Citation Zhou, YNie, TZhang, YSong, MLi, KDing, MDing, KWu, DXu, Y The discovery of novel and selective fatty acid binding protein 4 inhibitors by virtual screening and biological evaluation. Bioorg Med Chem24:4310-4317 (2016) 
 
Fatty acid-binding protein, adipocyte
Name:Fatty acid-binding protein, adipocyte
Type:Enzyme
Mol. Mass.:14719.23
Organism:Homo sapiens (Human)
Description:P15090
Residue:132
BDBM50187493
NameBDBM50187493
Synonyms:CHEMBL3827527
TypeSmall organic molecule
Emp. Form.C25H20ClN3O6S
Mol. Mass.525.961
SMILESOC(=O)c1cccc2C3C(Cl)C(CC3C(Nc12)c1ccccc1[N+]([O-])=O)Sc1ccccc1[N+]([O-])=O