Reaction Details
TargetSerine protease hepsin
LigandBDBM50187710
Substrate/Competitorn/a
Meas. Tech.ChEMBL_1589258 (CHEMBL3830286)
IC50 11000±n/a nM
Citation Subedi, MMinn, IChen, JKim, YOk, KJung, YWPomper, MGByun, Y Design, synthesis and biological evaluation of PSMA/hepsin-targeted heterobivalent ligands. Eur J Med Chem118:208-218 (2016) 
 
Serine protease hepsin
Name:Serine protease hepsin
Type:Enzyme
Mol. Mass.:45016.98
Organism:Homo sapiens (Human)
Description:Human deglycosylated hepsin was expressed in Pichia pastoris.
Residue:417
BDBM50187710
NameBDBM50187710
Synonyms:CHEMBL3827788
TypeSmall organic molecule
Emp. Form.C27H28N4O3
Mol. Mass.456.5362
SMILESCC(C)(C)OC(=O)NCc1ccc(cc1)-c1ccc(O)c(c1)-c1cc2cc(ccc2[nH]1)C(N)=N