Reaction Details
TargetSerine protease hepsin
LigandBDBM50187711
Substrate/Competitorn/a
Meas. Tech.ChEMBL_1589258 (CHEMBL3830286)
IC50 5900±n/a nM
Citation Subedi, MMinn, IChen, JKim, YOk, KJung, YWPomper, MGByun, Y Design, synthesis and biological evaluation of PSMA/hepsin-targeted heterobivalent ligands. Eur J Med Chem118:208-218 (2016) 
 
Serine protease hepsin
Name:Serine protease hepsin
Type:Enzyme
Mol. Mass.:45016.98
Organism:Homo sapiens (Human)
Description:Human deglycosylated hepsin was expressed in Pichia pastoris.
Residue:417
BDBM50187711
NameBDBM50187711
Synonyms:CHEMBL3827463
TypeSmall organic molecule
Emp. Form.C21H16FN3O
Mol. Mass.345.3696
SMILESNC(=N)c1ccc2[nH]c(cc2c1)-c1cc(ccc1O)-c1ccc(F)cc1