Reaction Details
TargetProto-oncogene tyrosine-protein kinase receptor Ret
LigandBDBM50362781
Substrate/Competitorn/a
Meas. Tech.ChEMBL_1589426 (CHEMBL3831011)
IC50 4.8±n/a nM
Citation Song, ZXia, ZJi, YXing, LGao, YAi, JGeng, MZhang, A An orally available tyrosine kinase ALK and RET dual inhibitor bearing the tetracyclic benzo[b]carbazolone core. Eur J Med Chem118:244-9 (2016) 
 
Proto-oncogene tyrosine-protein kinase receptor Ret
Name:Proto-oncogene tyrosine-protein kinase receptor Ret
Type:Protein
Mol. Mass.:124318.29
Organism:Homo sapiens (Human)
Description:P07949
Residue:1114
BDBM50362781
NameBDBM50362781
Synonyms:1256580-46-7 Alecensa CH5424802 US10851092, Example Alectinib US9126931, 366
TypeSmall organic molecule
Emp. Form.C30H34N4O2
Mol. Mass.482.6166
SMILESCCc1cc2C(=O)c3c([nH]c4cc(ccc34)C#N)C(C)(C)c2cc1N1CCC(CC1)N1CCOCC1