Reaction Details
TargetFibroblast growth factor receptor 1
LigandBDBM50189790
Substrate/Competitorn/a
Meas. Tech.ChEMBL_1590266 (CHEMBL3830044)
IC50 6.6±n/a nM
Citation Yan, WWang, XDai, YZhao, BYang, XFan, JGao, YMeng, FWang, YLuo, CAi, JGeng, MDuan, W Discovery of 3-(5'-Substituted)-Benzimidazole-5-(1-(3,5-dichloropyridin-4-yl)ethoxy)-1H-indazoles as Potent Fibroblast Growth Factor Receptor Inhibitors: Design, Synthesis, and Biological Evaluation. J Med Chem59:6690-708 (2016) 
 
Fibroblast growth factor receptor 1
Name:Fibroblast growth factor receptor 1
Type:Receptor
Mol. Mass.:91861.70
Organism:Homo sapiens (Human)
Description:P11362
Residue:822
BDBM50189790
NameBDBM50189790
Synonyms:CHEMBL3827042
TypeSmall organic molecule
Emp. Form.C25H22Cl2N6O
Mol. Mass.493.388
SMILESClc1cncc(Cl)c1COc1ccc2[nH]nc(-c3nc4cc(ccc4[nH]3)N3CCCCC3)c2c1