Reaction Details
TargetFibroblast growth factor receptor 1
LigandBDBM50189799
Substrate/Competitorn/a
Meas. Tech.ChEMBL_1590266 (CHEMBL3830044)
IC50 2.4±n/a nM
Citation Yan, WWang, XDai, YZhao, BYang, XFan, JGao, YMeng, FWang, YLuo, CAi, JGeng, MDuan, W Discovery of 3-(5'-Substituted)-Benzimidazole-5-(1-(3,5-dichloropyridin-4-yl)ethoxy)-1H-indazoles as Potent Fibroblast Growth Factor Receptor Inhibitors: Design, Synthesis, and Biological Evaluation. J Med Chem59:6690-708 (2016) 
 
Fibroblast growth factor receptor 1
Name:Fibroblast growth factor receptor 1
Type:Receptor
Mol. Mass.:91861.70
Organism:Homo sapiens (Human)
Description:P11362
Residue:822
BDBM50189799
NameBDBM50189799
Synonyms:CHEMBL3828173
TypeSmall organic molecule
Emp. Form.C22H16Cl2N4O
Mol. Mass.423.295
SMILESCC(Oc1ccc2[nH]nc(-c3cc4ccccc4[nH]3)c2c1)c1c(Cl)cncc1Cl