Reaction Details
TargetFibroblast growth factor receptor 1
LigandBDBM50189866
Substrate/Competitorn/a
Meas. Tech.ChEMBL_1590266 (CHEMBL3830044)
IC50 2.8±n/a nM
Citation Yan, WWang, XDai, YZhao, BYang, XFan, JGao, YMeng, FWang, YLuo, CAi, JGeng, MDuan, W Discovery of 3-(5'-Substituted)-Benzimidazole-5-(1-(3,5-dichloropyridin-4-yl)ethoxy)-1H-indazoles as Potent Fibroblast Growth Factor Receptor Inhibitors: Design, Synthesis, and Biological Evaluation. J Med Chem59:6690-708 (2016) 
 
Fibroblast growth factor receptor 1
Name:Fibroblast growth factor receptor 1
Type:Receptor
Mol. Mass.:91861.70
Organism:Homo sapiens (Human)
Description:P11362
Residue:822
BDBM50189866
NameBDBM50189866
Synonyms:CHEMBL3828142
TypeSmall organic molecule
Emp. Form.C22H17Cl2N5O2
Mol. Mass.454.309
SMILESCOc1ccc2[nH]c(nc2c1)-c1n[nH]c2ccc(OC(C)c3c(Cl)cncc3Cl)cc12