Reaction Details
TargetDihydrofolate reductase
LigandBDBM210928
Substrate/Competitorn/a
Meas. Tech.ChEMBL_1589520 (CHEMBL3829094)
Ki 3.1±n/a nM
Citation Scocchera, EReeve, SMKeshipeddy, SLombardo, MNHajian, BSochia, AEAlverson, JBPriestley, NDAnderson, ACWright, DL Charged Nonclassical Antifolates with Activity Against Gram-Positive and Gram-Negative Pathogens. ACS Med Chem Lett7:692-6 (2016) 
 
Dihydrofolate reductase
Name:Dihydrofolate reductase
Type:n/a
Mol. Mass.:17532.46
Organism:Escherichia coli
Description:n/a
Residue:157
BDBM210928
NameBDBM210928
Synonyms:UCP1164
TypeSmall organic molecule
Emp. Form.C24H24N4O3
Mol. Mass.416.4724
SMILESCCc1nc(N)nc(N)c1C#C[C@@H](C)c1cc(ccc1OC)-c1ccc(cc1)C(O)=O