Reaction Details
TargetRhodopsin kinase GRK1
LigandBDBM50331515
Substrate/Competitorn/a
Meas. Tech.ChEBML_1612830
IC50 398100±n/a nM
Citation Guccione, MEttari, RTaliani, SDa Settimo, FZappalą, MGrasso, S G-Protein-Coupled Receptor Kinase 2 (GRK2) Inhibitors: Current Trends and Future Perspectives. J Med Chem59:9277-9294 (2016) Rhodopsin kinase GRK1
Name:Rhodopsin kinase GRK1
Type:PROTEIN
Mol. Mass.:62931.24
Organism:Bos taurus
Description:ChEMBL_116985
Residue:561
BDBM50331515
NameBDBM50331515
Synonyms:CHEMBL1708 Paroxetine hydrochloride Paxil | Paxil cr
TypeSmall organic molecule
Emp. Form.C19H20FNO3
Mol. Mass.329.3654
SMILESFc1ccc(cc1)[C@@H]1CCNC[C@H]1COc1ccc2OCOc2c1