Reaction Details
TargetBeta-adrenergic receptor kinase 1
LigandBDBM50191315
Substrate/Competitorn/a
Meas. Tech.ChEMBL_1612834 (CHEMBL3854634)
IC50 1600000±n/a nM
Citation Guccione, MEttari, RTaliani, SDa Settimo, FZappalą, MGrasso, S G-Protein-Coupled Receptor Kinase 2 (GRK2) Inhibitors: Current Trends and Future Perspectives. J Med Chem59:9277-9294 (2016) Beta-adrenergic receptor kinase 1
Name:Beta-adrenergic receptor kinase 1
Type:PROTEIN
Mol. Mass.:79654.58
Organism:Bos taurus
Description:ChEMBL_113511
Residue:689
BDBM50191315
NameBDBM50191315
Synonyms:CHEMBL3900347
TypeSmall organic molecule
Emp. Form.C57H95N17O18
Mol. Mass.1306.4673
SMILESCC(C)C[C@H](NC(=O)[C@H](CCCNC(N)=N)NC(=O)[C@H](CCC(O)=O)NC(=O)[C@H](Cc1ccccc1)NC(=O)[C@H](CCCCN)NC(=O)[C@H](C)N)C(=O)N[C@@H](CCC(N)=O)C(=O)N[C@@H]([C@@H](C)O)C(=O)N[C@@H](C(C)C)C(=O)N[C@@H]([C@@H](C)O)C(=O)N[C@@H](CC(N)=O)C(O)=O