Reaction Details
TargetBeta-adrenergic receptor kinase 1
LigandBDBM50191323
Substrate/Competitorn/a
Meas. Tech.ChEMBL_1612804 (CHEMBL3854604)
IC50 3600000±n/a nM
Citation Guccione, MEttari, RTaliani, SDa Settimo, FZappalą, MGrasso, S G-Protein-Coupled Receptor Kinase 2 (GRK2) Inhibitors: Current Trends and Future Perspectives. J Med Chem59:9277-9294 (2016) Beta-adrenergic receptor kinase 1
Name:Beta-adrenergic receptor kinase 1
Type:PROTEIN
Mol. Mass.:79654.58
Organism:Bos taurus
Description:ChEMBL_113511
Residue:689
BDBM50191323
NameBDBM50191323
Synonyms:CHEMBL3959608
TypeSmall organic molecule
Emp. Form.C6H13O9P
Mol. Mass.260.1358
SMILESO[C@H]1[C@H](O)[C@@H](O)[C@H](OP(O)(O)=O)[C@H](O)[C@@H]1O