Reaction Details
TargetMitogen-activated protein kinase kinase kinase 8
LigandBDBM50191774
Substrate/Competitorn/a
Meas. Tech.ChEMBL_1613133 (CHEMBL3854933)
IC50 280±n/a nM
Citation Glatthar, RStojanovic, ATroxler, TMattes, HMöbitz, HBeerli, RBlanz, JGassmann, EDrückes, PFendrich, GGutmann, SMartiny-Baron, GSpence, FHornfeld, JPeel, JESparrer, H Discovery of Imidazoquinolines as a Novel Class of Potent, Selective, and in Vivo Efficacious Cancer Osaka Thyroid (COT) Kinase Inhibitors. J Med Chem59:7544-60 (2016) 
 
Mitogen-activated protein kinase kinase kinase 8
Name:Mitogen-activated protein kinase kinase kinase 8
Type:Serine/threonine-protein kinase
Mol. Mass.:52916.89
Organism:Homo sapiens (Human)
Description:P41279
Residue:467
BDBM50191774
NameBDBM50191774
Synonyms:CHEMBL3899461
TypeSmall organic molecule
Emp. Form.C28H25N7OS
Mol. Mass.507.609
SMILESC(CN1CCOCC1)Nc1nc2ccc(cc2s1)-n1cnc2cnc3cnc(cc3c12)-c1ccccc1