Reaction Details
TargetMitogen-activated protein kinase kinase kinase 8
LigandBDBM50191780
Substrate/Competitorn/a
Meas. Tech.ChEMBL_1613130 (CHEMBL3854930)
IC50 150±n/a nM
Citation Glatthar, RStojanovic, ATroxler, TMattes, HMöbitz, HBeerli, RBlanz, JGassmann, EDrückes, PFendrich, GGutmann, SMartiny-Baron, GSpence, FHornfeld, JPeel, JESparrer, H Discovery of Imidazoquinolines as a Novel Class of Potent, Selective, and in Vivo Efficacious Cancer Osaka Thyroid (COT) Kinase Inhibitors. J Med Chem59:7544-60 (2016) 
 
Mitogen-activated protein kinase kinase kinase 8
Name:Mitogen-activated protein kinase kinase kinase 8
Type:Serine/threonine-protein kinase
Mol. Mass.:52916.89
Organism:Homo sapiens (Human)
Description:P41279
Residue:467
BDBM50191780
NameBDBM50191780
Synonyms:CHEMBL3928098
TypeSmall organic molecule
Emp. Form.C19H12N8
Mol. Mass.352.3522
SMILESc1nc2ccc(cc2[nH]1)-n1cnc2cnc3cnc(cc3c12)-c1cn[nH]c1