Reaction Details
TargetMitogen-activated protein kinase kinase kinase 8
LigandBDBM50191771
Substrate/Competitorn/a
Meas. Tech.ChEMBL_1613140 (CHEMBL3854940)
IC50 600±n/a nM
Citation Glatthar, RStojanovic, ATroxler, TMattes, HMöbitz, HBeerli, RBlanz, JGassmann, EDrückes, PFendrich, GGutmann, SMartiny-Baron, GSpence, FHornfeld, JPeel, JESparrer, H Discovery of Imidazoquinolines as a Novel Class of Potent, Selective, and in Vivo Efficacious Cancer Osaka Thyroid (COT) Kinase Inhibitors. J Med Chem59:7544-60 (2016) 
 
Mitogen-activated protein kinase kinase kinase 8
Name:Mitogen-activated protein kinase kinase kinase 8
Type:Serine/threonine-protein kinase
Mol. Mass.:52916.89
Organism:Homo sapiens (Human)
Description:P41279
Residue:467
BDBM50191771
NameBDBM50191771
Synonyms:CHEMBL3890505
TypeSmall organic molecule
Emp. Form.C28H26N8OS
Mol. Mass.522.624
SMILESCC(CN1CCOCC1)Nc1nc2ccc(cc2s1)-n1cnc2cnc3cnc(cc3c12)-c1ccncc1