Reaction Details
TargetD(3) dopamine receptor
LigandBDBM50192023
Substrate/Competitorn/a
Meas. Tech.ChEMBL_1613477 (CHEMBL3855277)
Ki 0.338844±n/a nM
Citation Micheli, FBacchi, ABraggio, SCastelletti, LCavallini, PCavanni, PCremonesi, SDal Cin, MFeriani, AGehanne, SKajbaf, MMarchió, LNola, SOliosi, BPellacani, APerdoną, ESava, ASemeraro, TTarsi, LTomelleri, SWong, AVisentini, FZonzini, LHeidbreder, C 1,2,4-Triazolyl 5-Azaspiro[2.4]heptanes: Lead Identification and Early Lead Optimization of a New Series of Potent and Selective Dopamine D3 Receptor Antagonists. J Med Chem59:8549-76 (2016) 
 
D(3) dopamine receptor
Name:D(3) dopamine receptor
Type:n/a
Mol. Mass.:44243.43
Organism:Homo sapiens (Human)
Description:n/a
Residue:400
BDBM50192023
NameBDBM50192023
Synonyms:CHEMBL3950254 | US10239870, Example 184
TypeSmall organic molecule
Emp. Form.C25H27F3N6OS
Mol. Mass.516.582
SMILESCn1c(SCCCN2CC[C@]3(C[C@@H]3c3ccc(cc3)C(F)(F)F)C2)nnc1-c1ccc(nc1)C(N)=O