Reaction Details
TargetPotassium voltage-gated channel subfamily H member 2
LigandBDBM50192447
Substrate/Competitorn/a
Meas. Tech.ChEMBL_1613479 (CHEMBL3855279)
IC50 891±n/a nM
Citation Micheli, FBacchi, ABraggio, SCastelletti, LCavallini, PCavanni, PCremonesi, SDal Cin, MFeriani, AGehanne, SKajbaf, MMarchió, LNola, SOliosi, BPellacani, APerdoną, ESava, ASemeraro, TTarsi, LTomelleri, SWong, AVisentini, FZonzini, LHeidbreder, C 1,2,4-Triazolyl 5-Azaspiro[2.4]heptanes: Lead Identification and Early Lead Optimization of a New Series of Potent and Selective Dopamine D3 Receptor Antagonists. J Med Chem59:8549-76 (2016) 
 
Potassium voltage-gated channel subfamily H member 2
Name:Potassium voltage-gated channel subfamily H member 2
Type:Multi-pass membrane protein
Mol. Mass.:126672.65
Organism:Homo sapiens (Human)
Description:Q12809
Residue:1159
BDBM50192447
NameBDBM50192447
Synonyms:CHEMBL3975989 | US10239870, Example 53
TypeSmall organic molecule
Emp. Form.C23H26F3N5OS
Mol. Mass.477.546
SMILESCc1ncoc1-c1nnc(SCCCN2CC[C@@]3(C[C@@H]3c3ccccc3C(F)(F)F)C2)n1C