Reaction Details
TargetC-X-C chemokine receptor type 4
LigandBDBM50035696
Substrate/Competitorn/a
Meas. Tech.ChEMBL_1613508 (CHEMBL3855308)
IC50 6.0±n/a nM
Citation Di Maro, STrotta, AMBrancaccio, DDi Leva, FSLa Pietra, VIeraṇ, CNapolitano, MPortella, LD'Alterio, CSiciliano, RASementa, DTomassi, SCarotenuto, ANovellino, EScala, SMarinelli, L Exploring the N-Terminal Region of C-X-C Motif Chemokine 12 (CXCL12): Identification of Plasma-Stable Cyclic Peptides As Novel, Potent C-X-C Chemokine Receptor Type 4 (CXCR4) Antagonists. J Med Chem59:8369-80 (2016) 
 
C-X-C chemokine receptor type 4
Name:C-X-C chemokine receptor type 4
Type:Enzyme
Mol. Mass.:39754.61
Organism:Homo sapiens (Human)
Description:P61073
Residue:352
BDBM50035696
NameBDBM50035696
Synonyms:1,1''-{1,4-phenylenebis(methylene)}-bis{1,4,8,11-tetraaza-cyclotetradecane} 1,4,8,11-tetraazacyclotetradecanyl[4-(1,4,8,11-tetraazacyclotetradecanylmethyl)phenyl]methane(8HBr.2H2O) 11''-xylyl bis-1,4,8,11-tetraazacyclotetradecane AMD-3100 CHEMBL2311089 PLERIXAFOR OCTAHYDROCHLORIDE | US9205085, MSX-162
TypeSmall organic molecule
Emp. Form.C28H54N8
Mol. Mass.502.782
SMILESC(N1CCCNCCNCCCNCC1)c1ccc(CN2CCCNCCNCCCNCC2)cc1