Reaction Details
TargetCyclin-dependent kinase/G2/mitotic-specific cyclin- 1
LigandBDBM50193087
Substrate/Competitorn/a
Meas. Tech.ChEMBL_1614397 (CHEMBL3856466)
IC50 1.000000±n/a nM
Citation Sonawane, YATaylor, MANapoleon, JVRana, SContreras, JINatarajan, A Cyclin Dependent Kinase 9 Inhibitors for Cancer Therapy. J Med Chem59:8667-8684 (2016) 
 
Cyclin-dependent kinase/G2/mitotic-specific cyclin- 1
Name:Cyclin-dependent kinase/G2/mitotic-specific cyclin- 1
Type:Protein Complex
Mol. Mass.:n/a
Description:CDK1/Cyclin B complexes were purified from insect cells co-infected with baculovirus vectors containing each of the components.
Components:This complex has 2 components.
Component 1
Name:Cyclin-dependent kinase 1
Synonyms:CDC2 CDK1 CDKN1 Cell division protein kinase 1 P34CDC2 | p34 protein kinase
Type:Enzyme Subunit
Mol. Mass.:34101.08
Organism:Homo sapiens (Human)
Description:P06493
Residue:297
Component 2
Name:G2/mitotic-specific cyclin-B1
Synonyms:CCNB CCNB1_HUMAN
Type:Enzyme Subunit
Mol. Mass.:48340.95
Organism:Homo sapiens (Human)
Description:P14635
Residue:433
BDBM50193087
NameBDBM50193087
Synonyms:CHEMBL3897452
TypeSmall organic molecule
Emp. Form.C23H20F2N6
Mol. Mass.418.4419
SMILESCCNCc1cncc(c1C)-c1cccc2[nH]nc(-c3nc4c(F)cc(F)cc4[nH]3)c12